Upgrade from testNG version 6.8 to 6.11

classic Classic list List threaded Threaded
2 messages Options
Reply | Threaded
Open this post in threaded view
|

Upgrade from testNG version 6.8 to 6.11

Dipesh Patel

Hi I upgrade from testNg 6.8 to 6.11
Maven project started showing a compilation error.Project work fine with 6.8 but not with 6.11

[INFO] 68 errors


[INFO] -------------------------------------------------------------


[INFO] ------------------------------------------------------------------------


[INFO] BUILD FAILURE


[INFO] ------------------------------------------------------------------------


[INFO] Total time: 3.038 s


[INFO] Finished at: 2018-02-16T10:18:53Z


[INFO] Final Memory: 21M/201M


[INFO] ------------------------------------------------------------------------


[ERROR] Failed to execute goal org.apache.maven.plugins:maven-compiler-plugin:3.6.1:compile (default-compile) on project com.endclothing.magento: Compilation failure: Compilation failure:


[ERROR] /Users/dipeshpatel/Desktop/Projects/WorkSpace/com.endclothing.magento/src/main/java/com/endclothing/customlistners/RetryListenerAnalyzer.java:[4,18] package org.testng does not exist


[ERROR] /Users/dipeshpatel/Desktop/Projects/WorkSpace/com.endclothing.magento/src/main/java/com/endclothing/customlistners/RetryListenerAnalyzer.java:[5,18] package org.testng does not exist


[ERROR] /Users/dipeshpatel/Desktop/Projects/WorkSpace/com.endclothing.magento/src/main/java/com/endclothing/customlistners/RetryListenerAnalyzer.java:[8,47] cannot find symbol


[ERROR]   symbol: class IRetryAnalyzer


[ERROR] /Users/dipeshpatel/Desktop/Projects/WorkSpace/com.endclothing.magento/src/main/java/com/endclothing/customlistners/RetryListenerAnalyzer.java:[15,30] cannot find symbol


[ERROR]   symbol:   class ITestResult


[ERROR]   location: class com.endclothing.customlistners.RetryListenerAnalyzer


[ERROR] /Users/dipeshpatel/Desktop/Projects/WorkSpace/com.endclothing.magento/src/main/java/com/endclothing/testbase/Config.java:[22,18] package org.testng does not exist


[ERROR] /Users/dipeshpatel/Desktop/Projects/WorkSpace/com.endclothing.magento/src/main/java/com/endclothing/webpages/HomePage.java:[3,25] package org.testng does not exist


[ERROR] /Users/dipeshpatel/Desktop/Projects/WorkSpace/com.endclothing.magento/src/main/java/com/endclothing/webpages/HomePage.java:[3,1] static import only from classes and interfaces


[ERROR] /Users/dipeshpatel/Desktop/Projects/WorkSpace/com.endclothing.magento/src/main/java/com/endclothing/utilities/ElementActions.java:[21,18] package org.testng does not exist


[ERROR] /Users/dipeshpatel/Desktop/Projects/WorkSpace/com.endclothing.magento/src/main/java/com/endclothing/webpages/CartPage.java:[3,25] package org.testng does not exist


[ERROR] /Users/dipeshpatel/Desktop/Projects/WorkSpace/com.endclothing.magento/src/main/java/com/endclothing/webpages/CartPage.java:[3,1] static import only from classes and interfaces


[ERROR] /Users/dipeshpatel/Desktop/Projects/WorkSpace/com.endclothing.magento/src/main/java/com/endclothing/webpages/CartPage.java:[4,25] package org.testng does not exist


[ERROR] /Users/dipeshpatel/Desktop/Projects/WorkSpace/com.endclothing.magento/src/main/java/com/endclothing/webpages/CartPage.java:[4,1] static import only from classes and interfaces


[ERROR] /Users/dipeshpatel/Desktop/Projects/WorkSpace/com.endclothing.magento/src/main/java/com/endclothing/models/AddressModel.java:[6,27] package org.testng.internal does not exist


[ERROR] /Users/dipeshpatel/Desktop/Projects/WorkSpace/com.endclothing.magento/src/main/java/com/endclothing/customlistners/Listener.java:[4,18] package org.testng does not exist


[ERROR] /Users/dipeshpatel/Desktop/Projects/WorkSpace/com.endclothing.magento/src/main/java/com/endclothing/customlistners/Listener.java:[5,18] package org.testng does not exist


[ERROR] /Users/dipeshpatel/Desktop/Projects/WorkSpace/com.endclothing.magento/src/main/java/com/endclothing/customlistners/Listener.java:[6,18] package org.testng does not exist


[ERROR] /Users/dipeshpatel/Desktop/Projects/WorkSpace/com.endclothing.magento/src/main/java/com/endclothing/testbase/TestBase.java:[3,25] package org.testng does not exist


[ERROR] /Users/dipeshpatel/Desktop/Projects/WorkSpace/com.endclothing.magento/src/main/java/com/endclothing/testbase/TestBase.java:[3,1] static import only from classes and interfaces


[ERROR] /Users/dipeshpatel/Desktop/Projects/WorkSpace/com.endclothing.magento/src/main/java/com/endclothing/testbase/TestBase.java:[4,25] package org.testng does not exist


[ERROR] /Users/dipeshpatel/Desktop/Projects/WorkSpace/com.endclothing.magento/src/main/java/com/endclothing/testbase/TestBase.java:[4,1] static import only from classes and interfaces


[ERROR] /Users/dipeshpatel/Desktop/Projects/WorkSpace/com.endclothing.magento/src/main/java/com/endclothing/testbase/TestBase.java:[5,25] package org.testng does not exist


[ERROR] /Users/dipeshpatel/Desktop/Projects/WorkSpace/com.endclothing.magento/src/main/java/com/endclothing/testbase/TestBase.java:[5,1] static import only from classes and interfaces


[ERROR] /Users/dipeshpatel/Desktop/Projects/WorkSpace/com.endclothing.magento/src/main/java/com/endclothing/testbase/TestBase.java:[20,18] package org.testng does not exist


[ERROR] /Users/dipeshpatel/Desktop/Projects/WorkSpace/com.endclothing.magento/src/main/java/com/endclothing/testbase/TestBase.java:[21,30] package org.testng.annotations does not exist


[ERROR] /Users/dipeshpatel/Desktop/Projects/WorkSpace/com.endclothing.magento/src/main/java/com/endclothing/testbase/TestBase.java:[22,30] package org.testng.annotations does not exist


[ERROR] /Users/dipeshpatel/Desktop/Projects/WorkSpace/com.endclothing.magento/src/main/java/com/endclothing/testbase/TestBase.java:[23,30] package org.testng.annotations does not exist


[ERROR] /Users/dipeshpatel/Desktop/Projects/WorkSpace/com.endclothing.magento/src/main/java/com/endclothing/testbase/TestBase.java:[24,30] package org.testng.annotations does not exist


[ERROR] /Users/dipeshpatel/Desktop/Projects/WorkSpace/com.endclothing.magento/src/main/java/com/endclothing/testbase/TestBase.java:[25,30] package org.testng.annotations does not exist


[ERROR] /Users/dipeshpatel/Desktop/Projects/WorkSpace/com.endclothing.magento/src/main/java/com/endclothing/customlistners/Listener.java:[15,51] cannot find symbol


[ERROR]   symbol: class ITestListener


[ERROR] /Users/dipeshpatel/Desktop/Projects/WorkSpace/com.endclothing.magento/src/main/java/com/endclothing/customlistners/Listener.java:[18,30] cannot find symbol


[ERROR]   symbol:   class ITestContext


[ERROR]   location: class com.endclothing.customlistners.Listener


[ERROR] /Users/dipeshpatel/Desktop/Projects/WorkSpace/com.endclothing.magento/src/main/java/com/endclothing/customlistners/Listener.java:[23,29] cannot find symbol


[ERROR]   symbol:   class ITestContext


[ERROR]   location: class com.endclothing.customlistners.Listener


[ERROR] /Users/dipeshpatel/Desktop/Projects/WorkSpace/com.endclothing.magento/src/main/java/com/endclothing/customlistners/Listener.java:[28,60] cannot find symbol


[ERROR]   symbol:   class ITestResult


[ERROR]   location: class com.endclothing.customlistners.Listener


[ERROR] /Users/dipeshpatel/Desktop/Projects/WorkSpace/com.endclothing.magento/src/main/java/com/endclothing/customlistners/Listener.java:[33,35] cannot find symbol


[ERROR]   symbol:   class ITestResult


[ERROR]   location: class com.endclothing.customlistners.Listener


[ERROR] /Users/dipeshpatel/Desktop/Projects/WorkSpace/com.endclothing.magento/src/main/java/com/endclothing/customlistners/Listener.java:[50,33] cannot find symbol


[ERROR]   symbol:   class ITestResult


[ERROR]   location: class com.endclothing.customlistners.Listener


[ERROR] /Users/dipeshpatel/Desktop/Projects/WorkSpace/com.endclothing.magento/src/main/java/com/endclothing/customlistners/Listener.java:[54,35] cannot find symbol


[ERROR]   symbol:   class ITestResult


[ERROR]   location: class com.endclothing.customlistners.Listener


[ERROR] /Users/dipeshpatel/Desktop/Projects/WorkSpace/com.endclothing.magento/src/main/java/com/endclothing/customlistners/Listener.java:[58,35] cannot find symbol


[ERROR]   symbol:   class ITestResult


[ERROR]   location: class com.endclothing.customlistners.Listener


[ERROR] /Users/dipeshpatel/Desktop/Projects/WorkSpace/com.endclothing.magento/src/main/java/com/endclothing/testbase/TestBase.java:[111,37] cannot find symbol


[ERROR]   symbol:   class ITestResult


[ERROR]   location: class com.endclothing.testbase.TestBase


[ERROR] /Users/dipeshpatel/Desktop/Projects/WorkSpace/com.endclothing.magento/src/main/java/com/endclothing/testbase/TestBase.java:[154,31] cannot find symbol


[ERROR]   symbol:   class ITestResult


[ERROR]   location: class com.endclothing.testbase.TestBase


[ERROR] /Users/dipeshpatel/Desktop/Projects/WorkSpace/com.endclothing.magento/src/main/java/com/endclothing/customlistners/RetryListener.java:[6,18] package org.testng does not exist


[ERROR] /Users/dipeshpatel/Desktop/Projects/WorkSpace/com.endclothing.magento/src/main/java/com/endclothing/customlistners/RetryListener.java:[7,18] package org.testng does not exist


[ERROR] /Users/dipeshpatel/Desktop/Projects/WorkSpace/com.endclothing.magento/src/main/java/com/endclothing/customlistners/RetryListener.java:[8,30] package org.testng.annotations does not exist


[ERROR] /Users/dipeshpatel/Desktop/Projects/WorkSpace/com.endclothing.magento/src/main/java/com/endclothing/customlistners/RetryListener.java:[10,39] cannot find symbol


[ERROR]   symbol: class IAnnotationTransformer


[ERROR] /Users/dipeshpatel/Desktop/Projects/WorkSpace/com.endclothing.magento/src/main/java/com/endclothing/customlistners/RetryListener.java:[13,31] cannot find symbol


[ERROR]   symbol:   class ITestAnnotation


[ERROR]   location: class com.endclothing.customlistners.RetryListener


[ERROR] /Users/dipeshpatel/Desktop/Projects/WorkSpace/com.endclothing.magento/src/main/java/com/endclothing/models/AddressModel.java:[13,10] cannot find symbol


[ERROR]   symbol:   class Nullable


[ERROR]   location: class com.endclothing.models.AddressModel


[ERROR] /Users/dipeshpatel/Desktop/Projects/WorkSpace/com.endclothing.magento/src/main/java/com/endclothing/models/AddressModel.java:[15,10] cannot find symbol


[ERROR]   symbol:   class Nullable


[ERROR]   location: class com.endclothing.models.AddressModel


[ERROR] /Users/dipeshpatel/Desktop/Projects/WorkSpace/com.endclothing.magento/src/main/java/com/endclothing/testbase/TestBase.java:[57,10] cannot find symbol


[ERROR]   symbol:   class BeforeSuite


[ERROR]   location: class com.endclothing.testbase.TestBase


[ERROR] /Users/dipeshpatel/Desktop/Projects/WorkSpace/com.endclothing.magento/src/main/java/com/endclothing/testbase/TestBase.java:[66,10] cannot find symbol


[ERROR]   symbol:   class BeforeClass


[ERROR]   location: class com.endclothing.testbase.TestBase


[ERROR] /Users/dipeshpatel/Desktop/Projects/WorkSpace/com.endclothing.magento/src/main/java/com/endclothing/testbase/TestBase.java:[74,10] cannot find symbol


[ERROR]   symbol:   class BeforeMethod


[ERROR]   location: class com.endclothing.testbase.TestBase


[ERROR] /Users/dipeshpatel/Desktop/Projects/WorkSpace/com.endclothing.magento/src/main/java/com/endclothing/testbase/TestBase.java:[110,10] cannot find symbol


[ERROR]   symbol:   class AfterMethod


[ERROR]   location: class com.endclothing.testbase.TestBase


[ERROR] /Users/dipeshpatel/Desktop/Projects/WorkSpace/com.endclothing.magento/src/main/java/com/endclothing/testbase/TestBase.java:[123,10] cannot find symbol


[ERROR]   symbol:   class AfterClass


[ERROR]   location: class com.endclothing.testbase.TestBase


[ERROR] /Users/dipeshpatel/Desktop/Projects/WorkSpace/com.endclothing.magento/src/main/java/com/endclothing/customlistners/RetryListenerAnalyzer.java:[14,9] method does not override or implement a method from a supertype


[ERROR] /Users/dipeshpatel/Desktop/Projects/WorkSpace/com.endclothing.magento/src/main/java/com/endclothing/testbase/Config.java:[60,25] cannot find symbol


[ERROR]   symbol:   variable Assert


[ERROR]   location: class com.endclothing.testbase.Config


[ERROR] /Users/dipeshpatel/Desktop/Projects/WorkSpace/com.endclothing.magento/src/main/java/com/endclothing/utilities/ElementActions.java:[533,43] cannot find symbol


[ERROR]   symbol:   class TestException


[ERROR]   location: class com.endclothing.utilities.ElementActions


[ERROR] /Users/dipeshpatel/Desktop/Projects/WorkSpace/com.endclothing.magento/src/main/java/com/endclothing/utilities/ElementActions.java:[553,43] cannot find symbol


[ERROR]   symbol:   class TestException


[ERROR]   location: class com.endclothing.utilities.ElementActions


[ERROR] /Users/dipeshpatel/Desktop/Projects/WorkSpace/com.endclothing.magento/src/main/java/com/endclothing/webpages/HomePage.java:[274,17] cannot find symbol


[ERROR]   symbol:   method assertTrue(boolean,java.lang.String)


[ERROR]   location: class com.endclothing.webpages.HomePage


[ERROR] /Users/dipeshpatel/Desktop/Projects/WorkSpace/com.endclothing.magento/src/main/java/com/endclothing/webpages/CartPage.java:[650,17] cannot find symbol


[ERROR]   symbol:   method assertFalse(boolean)


[ERROR]   location: class com.endclothing.webpages.CartPage


[ERROR] /Users/dipeshpatel/Desktop/Projects/WorkSpace/com.endclothing.magento/src/main/java/com/endclothing/testbase/TestBase.java:[102,33] cannot find symbol


[ERROR]   symbol:   method assertFalse(boolean)


[ERROR]   location: class com.endclothing.testbase.TestBase


[ERROR] /Users/dipeshpatel/Desktop/Projects/WorkSpace/com.endclothing.magento/src/main/java/com/endclothing/testbase/TestBase.java:[156,43] cannot find symbol


[ERROR]   symbol:   variable ITestResult


[ERROR]   location: class com.endclothing.testbase.TestBase


[ERROR] /Users/dipeshpatel/Desktop/Projects/WorkSpace/com.endclothing.magento/src/main/java/com/endclothing/testbase/TestBase.java:[159,50] cannot find symbol


[ERROR]   symbol:   variable ITestResult


[ERROR]   location: class com.endclothing.testbase.TestBase


[ERROR] /Users/dipeshpatel/Desktop/Projects/WorkSpace/com.endclothing.magento/src/main/java/com/endclothing/testbase/TestBase.java:[165,50] cannot find symbol


[ERROR]   symbol:   variable ITestResult


[ERROR]   location: class com.endclothing.testbase.TestBase


[ERROR] /Users/dipeshpatel/Desktop/Projects/WorkSpace/com.endclothing.magento/src/main/java/com/endclothing/testbase/TestBase.java:[177,50] cannot find symbol


[ERROR]   symbol:   variable ITestResult


[ERROR]   location: class com.endclothing.testbase.TestBase


[ERROR] /Users/dipeshpatel/Desktop/Projects/WorkSpace/com.endclothing.magento/src/main/java/com/endclothing/testbase/TestBase.java:[289,17] cannot find symbol


[ERROR]   symbol:   method assertEquals(com.endclothing.models.CartModel,com.endclothing.models.CartModel)


[ERROR]   location: class com.endclothing.testbase.TestBase


[ERROR] /Users/dipeshpatel/Desktop/Projects/WorkSpace/com.endclothing.magento/src/main/java/com/endclothing/testbase/TestBase.java:[297,17] cannot find symbol


[ERROR]   symbol:   method assertEquals(com.endclothing.models.CartModel,com.endclothing.models.CartModel)


[ERROR]   location: class com.endclothing.testbase.TestBase


[ERROR] /Users/dipeshpatel/Desktop/Projects/WorkSpace/com.endclothing.magento/src/main/java/com/endclothing/testbase/TestBase.java:[305,17] cannot find symbol


[ERROR]   symbol:   method assertEquals(com.endclothing.models.CartModel,com.endclothing.models.CartModel)


[ERROR]   location: class com.endclothing.testbase.TestBase


[ERROR] /Users/dipeshpatel/Desktop/Projects/WorkSpace/com.endclothing.magento/src/main/java/com/endclothing/testbase/TestBase.java:[312,17] cannot find symbol


[ERROR]   symbol:   method assertEquals(com.endclothing.models.CartModel,com.endclothing.models.CartModel)


[ERROR]   location: class com.endclothing.testbase.TestBase


[ERROR] /Users/dipeshpatel/Desktop/Projects/WorkSpace/com.endclothing.magento/src/main/java/com/endclothing/testbase/TestBase.java:[319,17] cannot find symbol


[ERROR]   symbol:   method assertNotEquals(com.endclothing.models.AddressModel,com.endclothing.models.AddressModel)


[ERROR]   location: class com.endclothing.testbase.TestBase


[ERROR] /Users/dipeshpatel/Desktop/Projects/WorkSpace/com.endclothing.magento/src/main/java/com/endclothing/customlistners/RetryListener.java:[12,9] method does not override or implement a method from a supertype


[ERROR] /Users/dipeshpatel/Desktop/Projects/WorkSpace/com.endclothing.magento/src/main/java/com/endclothing/customlistners/RetryListener.java:[15,17] cannot find symbol


[ERROR]   symbol:   class IRetryAnalyzer


[ERROR]   location: class com.endclothing.customlistners.RetryListener





--
You received this message because you are subscribed to the Google Groups "testng-users" group.
To unsubscribe from this group and stop receiving emails from it, send an email to [hidden email].
To post to this group, send email to [hidden email].
Visit this group at https://groups.google.com/group/testng-users.
For more options, visit https://groups.google.com/d/optout.
Reply | Threaded
Open this post in threaded view
|

Re: Upgrade from testNG version 6.8 to 6.11

Krishnan Mahadevan
FYI,The latest released version of TestNG is 6.14.2

The errors seem to indicate that you either got TestNG libraries removed from your CLASSPATH, or your CLASSPATH is messed up.

Thanks & Regards
Krishnan Mahadevan

"All the desirable things in life are either illegal, expensive, fattening or in love with someone else!"
My Scribblings @ http://wakened-cognition.blogspot.com/
My Technical Scribbings @ http://rationaleemotions.wordpress.com/

On Fri, Feb 16, 2018 at 4:00 PM, Dipesh Patel <[hidden email]> wrote:

Hi I upgrade from testNg 6.8 to 6.11
Maven project started showing a compilation error.Project work fine with 6.8 but not with 6.11

[INFO] 68 errors


[INFO] -------------------------------------------------------------


[INFO] ------------------------------------------------------------------------


[INFO] BUILD FAILURE


[INFO] ------------------------------------------------------------------------


[INFO] Total time: 3.038 s


[INFO] Finished at: 2018-02-16T10:18:53Z


[INFO] Final Memory: 21M/201M


[INFO] ------------------------------------------------------------------------


[ERROR] Failed to execute goal org.apache.maven.plugins:maven-compiler-plugin:3.6.1:compile (default-compile) on project com.endclothing.magento: Compilation failure: Compilation failure:


[ERROR] /Users/dipeshpatel/Desktop/Projects/WorkSpace/com.endclothing.magento/src/main/java/com/endclothing/customlistners/RetryListenerAnalyzer.java:[4,18] package org.testng does not exist


[ERROR] /Users/dipeshpatel/Desktop/Projects/WorkSpace/com.endclothing.magento/src/main/java/com/endclothing/customlistners/RetryListenerAnalyzer.java:[5,18] package org.testng does not exist


[ERROR] /Users/dipeshpatel/Desktop/Projects/WorkSpace/com.endclothing.magento/src/main/java/com/endclothing/customlistners/RetryListenerAnalyzer.java:[8,47] cannot find symbol


[ERROR]   symbol: class IRetryAnalyzer


[ERROR] /Users/dipeshpatel/Desktop/Projects/WorkSpace/com.endclothing.magento/src/main/java/com/endclothing/customlistners/RetryListenerAnalyzer.java:[15,30] cannot find symbol


[ERROR]   symbol:   class ITestResult


[ERROR]   location: class com.endclothing.customlistners.RetryListenerAnalyzer


[ERROR] /Users/dipeshpatel/Desktop/Projects/WorkSpace/com.endclothing.magento/src/main/java/com/endclothing/testbase/Config.java:[22,18] package org.testng does not exist


[ERROR] /Users/dipeshpatel/Desktop/Projects/WorkSpace/com.endclothing.magento/src/main/java/com/endclothing/webpages/HomePage.java:[3,25] package org.testng does not exist


[ERROR] /Users/dipeshpatel/Desktop/Projects/WorkSpace/com.endclothing.magento/src/main/java/com/endclothing/webpages/HomePage.java:[3,1] static import only from classes and interfaces


[ERROR] /Users/dipeshpatel/Desktop/Projects/WorkSpace/com.endclothing.magento/src/main/java/com/endclothing/utilities/ElementActions.java:[21,18] package org.testng does not exist


[ERROR] /Users/dipeshpatel/Desktop/Projects/WorkSpace/com.endclothing.magento/src/main/java/com/endclothing/webpages/CartPage.java:[3,25] package org.testng does not exist


[ERROR] /Users/dipeshpatel/Desktop/Projects/WorkSpace/com.endclothing.magento/src/main/java/com/endclothing/webpages/CartPage.java:[3,1] static import only from classes and interfaces


[ERROR] /Users/dipeshpatel/Desktop/Projects/WorkSpace/com.endclothing.magento/src/main/java/com/endclothing/webpages/CartPage.java:[4,25] package org.testng does not exist


[ERROR] /Users/dipeshpatel/Desktop/Projects/WorkSpace/com.endclothing.magento/src/main/java/com/endclothing/webpages/CartPage.java:[4,1] static import only from classes and interfaces


[ERROR] /Users/dipeshpatel/Desktop/Projects/WorkSpace/com.endclothing.magento/src/main/java/com/endclothing/models/AddressModel.java:[6,27] package org.testng.internal does not exist


[ERROR] /Users/dipeshpatel/Desktop/Projects/WorkSpace/com.endclothing.magento/src/main/java/com/endclothing/customlistners/Listener.java:[4,18] package org.testng does not exist


[ERROR] /Users/dipeshpatel/Desktop/Projects/WorkSpace/com.endclothing.magento/src/main/java/com/endclothing/customlistners/Listener.java:[5,18] package org.testng does not exist


[ERROR] /Users/dipeshpatel/Desktop/Projects/WorkSpace/com.endclothing.magento/src/main/java/com/endclothing/customlistners/Listener.java:[6,18] package org.testng does not exist


[ERROR] /Users/dipeshpatel/Desktop/Projects/WorkSpace/com.endclothing.magento/src/main/java/com/endclothing/testbase/TestBase.java:[3,25] package org.testng does not exist


[ERROR] /Users/dipeshpatel/Desktop/Projects/WorkSpace/com.endclothing.magento/src/main/java/com/endclothing/testbase/TestBase.java:[3,1] static import only from classes and interfaces


[ERROR] /Users/dipeshpatel/Desktop/Projects/WorkSpace/com.endclothing.magento/src/main/java/com/endclothing/testbase/TestBase.java:[4,25] package org.testng does not exist


[ERROR] /Users/dipeshpatel/Desktop/Projects/WorkSpace/com.endclothing.magento/src/main/java/com/endclothing/testbase/TestBase.java:[4,1] static import only from classes and interfaces


[ERROR] /Users/dipeshpatel/Desktop/Projects/WorkSpace/com.endclothing.magento/src/main/java/com/endclothing/testbase/TestBase.java:[5,25] package org.testng does not exist


[ERROR] /Users/dipeshpatel/Desktop/Projects/WorkSpace/com.endclothing.magento/src/main/java/com/endclothing/testbase/TestBase.java:[5,1] static import only from classes and interfaces


[ERROR] /Users/dipeshpatel/Desktop/Projects/WorkSpace/com.endclothing.magento/src/main/java/com/endclothing/testbase/TestBase.java:[20,18] package org.testng does not exist


[ERROR] /Users/dipeshpatel/Desktop/Projects/WorkSpace/com.endclothing.magento/src/main/java/com/endclothing/testbase/TestBase.java:[21,30] package org.testng.annotations does not exist


[ERROR] /Users/dipeshpatel/Desktop/Projects/WorkSpace/com.endclothing.magento/src/main/java/com/endclothing/testbase/TestBase.java:[22,30] package org.testng.annotations does not exist


[ERROR] /Users/dipeshpatel/Desktop/Projects/WorkSpace/com.endclothing.magento/src/main/java/com/endclothing/testbase/TestBase.java:[23,30] package org.testng.annotations does not exist


[ERROR] /Users/dipeshpatel/Desktop/Projects/WorkSpace/com.endclothing.magento/src/main/java/com/endclothing/testbase/TestBase.java:[24,30] package org.testng.annotations does not exist


[ERROR] /Users/dipeshpatel/Desktop/Projects/WorkSpace/com.endclothing.magento/src/main/java/com/endclothing/testbase/TestBase.java:[25,30] package org.testng.annotations does not exist


[ERROR] /Users/dipeshpatel/Desktop/Projects/WorkSpace/com.endclothing.magento/src/main/java/com/endclothing/customlistners/Listener.java:[15,51] cannot find symbol


[ERROR]   symbol: class ITestListener


[ERROR] /Users/dipeshpatel/Desktop/Projects/WorkSpace/com.endclothing.magento/src/main/java/com/endclothing/customlistners/Listener.java:[18,30] cannot find symbol


[ERROR]   symbol:   class ITestContext


[ERROR]   location: class com.endclothing.customlistners.Listener


[ERROR] /Users/dipeshpatel/Desktop/Projects/WorkSpace/com.endclothing.magento/src/main/java/com/endclothing/customlistners/Listener.java:[23,29] cannot find symbol


[ERROR]   symbol:   class ITestContext


[ERROR]   location: class com.endclothing.customlistners.Listener


[ERROR] /Users/dipeshpatel/Desktop/Projects/WorkSpace/com.endclothing.magento/src/main/java/com/endclothing/customlistners/Listener.java:[28,60] cannot find symbol


[ERROR]   symbol:   class ITestResult


[ERROR]   location: class com.endclothing.customlistners.Listener


[ERROR] /Users/dipeshpatel/Desktop/Projects/WorkSpace/com.endclothing.magento/src/main/java/com/endclothing/customlistners/Listener.java:[33,35] cannot find symbol


[ERROR]   symbol:   class ITestResult


[ERROR]   location: class com.endclothing.customlistners.Listener


[ERROR] /Users/dipeshpatel/Desktop/Projects/WorkSpace/com.endclothing.magento/src/main/java/com/endclothing/customlistners/Listener.java:[50,33] cannot find symbol


[ERROR]   symbol:   class ITestResult


[ERROR]   location: class com.endclothing.customlistners.Listener


[ERROR] /Users/dipeshpatel/Desktop/Projects/WorkSpace/com.endclothing.magento/src/main/java/com/endclothing/customlistners/Listener.java:[54,35] cannot find symbol


[ERROR]   symbol:   class ITestResult


[ERROR]   location: class com.endclothing.customlistners.Listener


[ERROR] /Users/dipeshpatel/Desktop/Projects/WorkSpace/com.endclothing.magento/src/main/java/com/endclothing/customlistners/Listener.java:[58,35] cannot find symbol


[ERROR]   symbol:   class ITestResult


[ERROR]   location: class com.endclothing.customlistners.Listener


[ERROR] /Users/dipeshpatel/Desktop/Projects/WorkSpace/com.endclothing.magento/src/main/java/com/endclothing/testbase/TestBase.java:[111,37] cannot find symbol


[ERROR]   symbol:   class ITestResult


[ERROR]   location: class com.endclothing.testbase.TestBase


[ERROR] /Users/dipeshpatel/Desktop/Projects/WorkSpace/com.endclothing.magento/src/main/java/com/endclothing/testbase/TestBase.java:[154,31] cannot find symbol


[ERROR]   symbol:   class ITestResult


[ERROR]   location: class com.endclothing.testbase.TestBase


[ERROR] /Users/dipeshpatel/Desktop/Projects/WorkSpace/com.endclothing.magento/src/main/java/com/endclothing/customlistners/RetryListener.java:[6,18] package org.testng does not exist


[ERROR] /Users/dipeshpatel/Desktop/Projects/WorkSpace/com.endclothing.magento/src/main/java/com/endclothing/customlistners/RetryListener.java:[7,18] package org.testng does not exist


[ERROR] /Users/dipeshpatel/Desktop/Projects/WorkSpace/com.endclothing.magento/src/main/java/com/endclothing/customlistners/RetryListener.java:[8,30] package org.testng.annotations does not exist


[ERROR] /Users/dipeshpatel/Desktop/Projects/WorkSpace/com.endclothing.magento/src/main/java/com/endclothing/customlistners/RetryListener.java:[10,39] cannot find symbol


[ERROR]   symbol: class IAnnotationTransformer


[ERROR] /Users/dipeshpatel/Desktop/Projects/WorkSpace/com.endclothing.magento/src/main/java/com/endclothing/customlistners/RetryListener.java:[13,31] cannot find symbol


[ERROR]   symbol:   class ITestAnnotation


[ERROR]   location: class com.endclothing.customlistners.RetryListener


[ERROR] /Users/dipeshpatel/Desktop/Projects/WorkSpace/com.endclothing.magento/src/main/java/com/endclothing/models/AddressModel.java:[13,10] cannot find symbol


[ERROR]   symbol:   class Nullable


[ERROR]   location: class com.endclothing.models.AddressModel


[ERROR] /Users/dipeshpatel/Desktop/Projects/WorkSpace/com.endclothing.magento/src/main/java/com/endclothing/models/AddressModel.java:[15,10] cannot find symbol


[ERROR]   symbol:   class Nullable


[ERROR]   location: class com.endclothing.models.AddressModel


[ERROR] /Users/dipeshpatel/Desktop/Projects/WorkSpace/com.endclothing.magento/src/main/java/com/endclothing/testbase/TestBase.java:[57,10] cannot find symbol


[ERROR]   symbol:   class BeforeSuite


[ERROR]   location: class com.endclothing.testbase.TestBase


[ERROR] /Users/dipeshpatel/Desktop/Projects/WorkSpace/com.endclothing.magento/src/main/java/com/endclothing/testbase/TestBase.java:[66,10] cannot find symbol


[ERROR]   symbol:   class BeforeClass


[ERROR]   location: class com.endclothing.testbase.TestBase


[ERROR] /Users/dipeshpatel/Desktop/Projects/WorkSpace/com.endclothing.magento/src/main/java/com/endclothing/testbase/TestBase.java:[74,10] cannot find symbol


[ERROR]   symbol:   class BeforeMethod


[ERROR]   location: class com.endclothing.testbase.TestBase


[ERROR] /Users/dipeshpatel/Desktop/Projects/WorkSpace/com.endclothing.magento/src/main/java/com/endclothing/testbase/TestBase.java:[110,10] cannot find symbol


[ERROR]   symbol:   class AfterMethod


[ERROR]   location: class com.endclothing.testbase.TestBase


[ERROR] /Users/dipeshpatel/Desktop/Projects/WorkSpace/com.endclothing.magento/src/main/java/com/endclothing/testbase/TestBase.java:[123,10] cannot find symbol


[ERROR]   symbol:   class AfterClass


[ERROR]   location: class com.endclothing.testbase.TestBase


[ERROR] /Users/dipeshpatel/Desktop/Projects/WorkSpace/com.endclothing.magento/src/main/java/com/endclothing/customlistners/RetryListenerAnalyzer.java:[14,9] method does not override or implement a method from a supertype


[ERROR] /Users/dipeshpatel/Desktop/Projects/WorkSpace/com.endclothing.magento/src/main/java/com/endclothing/testbase/Config.java:[60,25] cannot find symbol


[ERROR]   symbol:   variable Assert


[ERROR]   location: class com.endclothing.testbase.Config


[ERROR] /Users/dipeshpatel/Desktop/Projects/WorkSpace/com.endclothing.magento/src/main/java/com/endclothing/utilities/ElementActions.java:[533,43] cannot find symbol


[ERROR]   symbol:   class TestException


[ERROR]   location: class com.endclothing.utilities.ElementActions


[ERROR] /Users/dipeshpatel/Desktop/Projects/WorkSpace/com.endclothing.magento/src/main/java/com/endclothing/utilities/ElementActions.java:[553,43] cannot find symbol


[ERROR]   symbol:   class TestException


[ERROR]   location: class com.endclothing.utilities.ElementActions


[ERROR] /Users/dipeshpatel/Desktop/Projects/WorkSpace/com.endclothing.magento/src/main/java/com/endclothing/webpages/HomePage.java:[274,17] cannot find symbol


[ERROR]   symbol:   method assertTrue(boolean,java.lang.String)


[ERROR]   location: class com.endclothing.webpages.HomePage


[ERROR] /Users/dipeshpatel/Desktop/Projects/WorkSpace/com.endclothing.magento/src/main/java/com/endclothing/webpages/CartPage.java:[650,17] cannot find symbol


[ERROR]   symbol:   method assertFalse(boolean)


[ERROR]   location: class com.endclothing.webpages.CartPage


[ERROR] /Users/dipeshpatel/Desktop/Projects/WorkSpace/com.endclothing.magento/src/main/java/com/endclothing/testbase/TestBase.java:[102,33] cannot find symbol


[ERROR]   symbol:   method assertFalse(boolean)


[ERROR]   location: class com.endclothing.testbase.TestBase


[ERROR] /Users/dipeshpatel/Desktop/Projects/WorkSpace/com.endclothing.magento/src/main/java/com/endclothing/testbase/TestBase.java:[156,43] cannot find symbol


[ERROR]   symbol:   variable ITestResult


[ERROR]   location: class com.endclothing.testbase.TestBase


[ERROR] /Users/dipeshpatel/Desktop/Projects/WorkSpace/com.endclothing.magento/src/main/java/com/endclothing/testbase/TestBase.java:[159,50] cannot find symbol


[ERROR]   symbol:   variable ITestResult


[ERROR]   location: class com.endclothing.testbase.TestBase


[ERROR] /Users/dipeshpatel/Desktop/Projects/WorkSpace/com.endclothing.magento/src/main/java/com/endclothing/testbase/TestBase.java:[165,50] cannot find symbol


[ERROR]   symbol:   variable ITestResult


[ERROR]   location: class com.endclothing.testbase.TestBase


[ERROR] /Users/dipeshpatel/Desktop/Projects/WorkSpace/com.endclothing.magento/src/main/java/com/endclothing/testbase/TestBase.java:[177,50] cannot find symbol


[ERROR]   symbol:   variable ITestResult


[ERROR]   location: class com.endclothing.testbase.TestBase


[ERROR] /Users/dipeshpatel/Desktop/Projects/WorkSpace/com.endclothing.magento/src/main/java/com/endclothing/testbase/TestBase.java:[289,17] cannot find symbol


[ERROR]   symbol:   method assertEquals(com.endclothing.models.CartModel,com.endclothing.models.CartModel)


[ERROR]   location: class com.endclothing.testbase.TestBase


[ERROR] /Users/dipeshpatel/Desktop/Projects/WorkSpace/com.endclothing.magento/src/main/java/com/endclothing/testbase/TestBase.java:[297,17] cannot find symbol


[ERROR]   symbol:   method assertEquals(com.endclothing.models.CartModel,com.endclothing.models.CartModel)


[ERROR]   location: class com.endclothing.testbase.TestBase


[ERROR] /Users/dipeshpatel/Desktop/Projects/WorkSpace/com.endclothing.magento/src/main/java/com/endclothing/testbase/TestBase.java:[305,17] cannot find symbol


[ERROR]   symbol:   method assertEquals(com.endclothing.models.CartModel,com.endclothing.models.CartModel)


[ERROR]   location: class com.endclothing.testbase.TestBase


[ERROR] /Users/dipeshpatel/Desktop/Projects/WorkSpace/com.endclothing.magento/src/main/java/com/endclothing/testbase/TestBase.java:[312,17] cannot find symbol


[ERROR]   symbol:   method assertEquals(com.endclothing.models.CartModel,com.endclothing.models.CartModel)


[ERROR]   location: class com.endclothing.testbase.TestBase


[ERROR] /Users/dipeshpatel/Desktop/Projects/WorkSpace/com.endclothing.magento/src/main/java/com/endclothing/testbase/TestBase.java:[319,17] cannot find symbol


[ERROR]   symbol:   method assertNotEquals(com.endclothing.models.AddressModel,com.endclothing.models.AddressModel)


[ERROR]   location: class com.endclothing.testbase.TestBase


[ERROR] /Users/dipeshpatel/Desktop/Projects/WorkSpace/com.endclothing.magento/src/main/java/com/endclothing/customlistners/RetryListener.java:[12,9] method does not override or implement a method from a supertype


[ERROR] /Users/dipeshpatel/Desktop/Projects/WorkSpace/com.endclothing.magento/src/main/java/com/endclothing/customlistners/RetryListener.java:[15,17] cannot find symbol


[ERROR]   symbol:   class IRetryAnalyzer


[ERROR]   location: class com.endclothing.customlistners.RetryListener





--
You received this message because you are subscribed to the Google Groups "testng-users" group.
To unsubscribe from this group and stop receiving emails from it, send an email to [hidden email].
To post to this group, send email to [hidden email].
Visit this group at https://groups.google.com/group/testng-users.
For more options, visit https://groups.google.com/d/optout.

--
You received this message because you are subscribed to the Google Groups "testng-users" group.
To unsubscribe from this group and stop receiving emails from it, send an email to [hidden email].
To post to this group, send email to [hidden email].
Visit this group at https://groups.google.com/group/testng-users.
For more options, visit https://groups.google.com/d/optout.